Error C2514 Forward Declaration

RECOMMENDED: If you have Windows errors then we strongly recommend that you download and run this (Windows) Repair Tool.

c++ – class has no constructor forward declaration – Stack. – class has no constructor forward declaration. Compiler Error: error C2514:. Forward declaration container used to simplify class constructors. 111.

Thats because you have used forward declaration of structure Type1 and used it's constructor in same file. When using the forward declaration, you cant use any.

Nov 16, 2010. You are #include -ing Level 's complete declaration: #include <Level.hpp>.and then you try to forward-declare Level : namespace Game.

Gm Radio Cd Error Expert: GM Tech (Cam) replied 8 years ago. Radio Will Not Accept CD (Reprogram Radio) – (Nov 9, 2005) Subject: CD Player Long Load-to-Play Time, Error Message, CD Does Not Return to Previous Track, CD Does Not Play, CD Does. App-fnd-01206 Error Save GL account then error APP-FND-01206: This record already exist. A Hana asked

Compiler Errors C2500 Through C2599 Compiler Error C2535. Compiler Error C2535. Compiler Error C2514 · Compiler Error. C2535.cpp // compile with: /c class C { public: void func(); // forward declaration void func() {} // C2535 };. Show:

That declaration means hurricane conditions are possible within. The Florida Highway Patrol said abandoned or disabled vehicles will be towed. The storm’s forward speed slowed slightly to 16 mph, as it pursued a course that.

App-fnd-01206 Error Save GL account then error APP-FND-01206: This record already exist. A Hana asked Jan 26, 2010 | Replies. I dont understand. APP-FND-01206 symptom:. May 21, 2013. Hi all, I'm getting the below error message in AR when I import the invoices with the help of external sources, with the help of. Error Reading Information On

error C2514 class has no constructors. Ask Question. up vote 6 down vote favorite. 1. I'm getting: Error 1 error C2514:. a forward declaration of.

Error 1 error C2514:. Use things like forward declaration so that you don't need the include in the header file. Error C2514 – Class has no constructors

Forward declaration wrong. – vs2008 gives me the following error: 1>—– Build started: Project: FlowingHeat, Configuration: Debug Win32 —– 1>Compiling. 1>main.cpp 1>g:computationc++cfdflowingheatflowingheatequation.h(56) : error C2514:.

How To Fix Error C2514 Forward Declaration – error c2514 forward declaration. here for a quick overview of the site Help Center Detailed answers to any questions you might have Meta Discuss the workings and.

SAN PEDRO SULA, Honduras — A raucous crowd, encouraged by the declaration of a national holiday and the. Shortly before that, forward Jozy Altidore.

The facility was initially approved by a 3-1 vote by the Planning Commission on a “negative declaration. think was an egregious error in your decision in May to tentatively approve the above facility that, if carried forward, will.

FindDialog.cpp(2) : fatal error C1083: Cannot open include file:. FindDialog.cpp (7) : error C2514: 'QLabel' : class has no constructors. src/gui/dialogs/qdialog.h( 31) : see declaration of 'QPushButton' 1>. You should include all the headers for the classes that you forward declared in FindDialog.h.

Feb 8, 2016. The error on the line currentState = new TitleGameState(renderer, kbd); is because the compiler has yet to see the constructor for the class.

RECOMMENDED: Click here to fix Windows errors and improve system performance